{"text_format":"1","workbook":"xlsx","n_sheets":25,"sheets":["H - List of Data Indicators","18-19 Prelim Allocations","18-19_Final_Allocations","Budget Overview","Goals and Strategies","Personnel Expenditures","H - Classifications","H - Benefit Rates","H - Pivots","Expenditures","H - Functional Areas","H- Types of Expenditures","H - GL Accounts","Funds Management","Remaining Balance","H-RB Summary","Special Activity Expenditures","Comparison Sheet","FM Calculations","H - School Names and Number","H - Teacher Unpaid Days Off","H - Guidance Counselor Days Off","H- School Psychologist Days Off","H - Para Unpaid Days Off","H - Month Calculations"],"not_rendered":{"charts":1,"images":1,"macros":1,"external_links":0,"defined_names":63,"comments":4,"pivot_tables":13},"unopened":[],"bounds":{"document_bytes":16777216,"sheet_cells":100000,"rows_first":2000,"rows_last":500,"rows_between":2000,"halvings":0,"cell_chars":16384,"cell_head_chars":4096},"cells_cut":0,"cells_raw":0,"read":"whole","date_system":"1900"}

{"sheet":"H - List of Data Indicators","index":0,"n_rows":8,"n_cols":1,"rows_kept":8,"cut":false,"hidden":true,"merged":[]}
["Data Indicator"]
["English Language Arts - FSA Data"]
["Math - FSA Data"]
["ELL Data"]
["Graduation Rates"]
["Graduation Rate Gap - SWD"]
{"$rows_left_out":3}
{"sheet":"18-19 Prelim Allocations","index":1,"n_rows":100,"n_cols":10,"rows_kept":100,"cut":false,"hidden":true,"merged":[]}
["School","Center","Option 2 CLIF Number Final","Option 2 CLIF %","PPA Amount","Cost Sharing Total","Basic Allocation","Projected Staff Costs (LookUP)","Remaining Allocation","Prelim PFE"]
["Choose School Name","####",null,null,null,0,0,0,null,0]
["Alta Vista Elementary",331,716,100,478,29485,342248,257891,54872,0]
["Alturas Elementary",1041,345,100,454,14207,156630,96054,46369,0]
["Auburndale Central Elementary",851,369,100,478,15195,176382,271337,-110150,0]
["Auburndale Senior High",811,776,69,400,31956,310400,0,278444,0]
{"$rows_left_out":95}
{"sheet":"18-19_Final_Allocations","index":2,"n_rows":140,"n_cols":4,"rows_kept":140,"cut":false,"hidden":true,"merged":[]}
["Name","Location Number","Basic Allocation","PFE Allocation"]
["ROOSEVELT ACADEMY",1381,94432,957]
["VICTORY RIDGE ACADEMY",8143,82694,832]
["COMPASS MIDDLE CHARTER SCHOOL",932,70641,698]
["CITRUS RIDGE A CIVICS ACADEMY",1032,585600,6876]
["HAINES CITY SENIOR HIGH SCHOOL",1791,574000,6740]
{"$rows_left_out":135}
{"sheet":"Budget Overview","index":3,"n_rows":32,"n_cols":8,"rows_kept":32,"cut":false,"hidden":false,"merged":[[3,0,3,1],[3,3,3,4],[3,6,3,7],[0,0,0,7],[1,0,1,7]]}
["Tenoroc High"]
[{"$f":"IFERROR(INDEX('18-19 Prelim Allocations'!B:B,MATCH('Budget Overview'!$A$1,'18-19 Prelim Allocations'!A:A,0)),\"\")","v":1051}]
[]
["Budget",null,null,"Planned Expenditures",null,null,"Plan Summary"]
["Basic Allocation",{"$f":"INDEX('18-19_Final_Allocations'!C:C,MATCH('Budget Overview'!$A$2,'18-19_Final_Allocations'!B:B,0))","v":274566},null,"Parent and Family Engagement Non Staff Expenditures",{"$f":"IFERROR(GETPIVOTDATA(\"Total Cost of Expenditure\",'H - Pivots'!$A$72,\"Functional Area\",\"6150 - Family Engagement\"),0)","v":5830.41},null,"Remaining Parent and Family Engagment Minimum",{"$f":"IFERROR(IF(B7-(E5+E7)<0,0,B7-(E5+E7)),\"\")","v":0}]
[]
{"$rows_left_out":27}
{"sheet":"Goals and Strategies","index":4,"n_rows":29,"n_cols":3,"rows_kept":29,"cut":false,"hidden":true,"merged":[[5,0,12,0],[13,0,20,0],[21,0,28,0]]}
["Title I (School Improvement) Plan Goals, Barriers, and Strategies"]
[]
[{"$f":"'Budget Overview'!A1","v":"Tenoroc High"},{"$f":"'Budget Overview'!A2","v":1051},"Guidance"]
[]
["School Improvement Plan Goals","Which of your SIP strategies can be supplemented with funding from Title I?"]
["Goal 1 - ","G1S1"]
{"$rows_left_out":24}
{"sheet":"Personnel Expenditures","index":5,"n_rows":58,"n_cols":63,"rows_kept":58,"cut":false,"hidden":false,"merged":[[3,6,3,14],[0,1,0,15],[1,3,1,6],[1,9,1,12],[3,59,3,61],[3,15,3,16]]}
[null,"Title I Personnel Expenditures Funded by School Allocation",null,null,null,null,null,null,null,null,null,null,null,null,null,null,null,null,null,null,null,null,null,null,null,null,null,null,null,null,null,null,null,null,null,"Guidance"]
[null,null,null,{"$f":"'Budget Overview'!A1","v":"Tenoroc High"},null,null,null,null,null,{"$f":"'Budget Overview'!A2","v":1051}]
[]
[null,null,null,null,null,null,"Full Time Personnel Info Only",null,null,null,null,null,null,null,null,"Special Activity Only",null,null,null,null,null,null,null,null,null,null,null,null,null,null,null,null,null,null,null,null,null,null,null,null,null,null,null,null,null,null,null,null,null,null,null,null,null,null,null,null,null,null,null,"Office Use Only"]
["Funding","Type of Personnel Expense","Staff Name or Description of Special Activity","Strategy","Job Title","Functional Area","Position #","SAP #","New Hire","Start Date","End Date","% Title I","Current Total Salary","Currently In DROP","Health Insurance Taken","Number of Special Activity Hours","Special Activity Pay Rate","GL Account","Funct-GL Account","Functional Area2","Total Worked Days","Title I Paid Salary Final","Retirement Final","Social Security Final","Health Insurance","Life Insurance","Worker Comp","School Number","SA - Pay Rate","SA - Total Salary","SA - Retirement","SA - SS","SA - WC","SA - Total Salary and Benefits","FTP - Total Salary and Benefits","Total Salary and Benefits","Class #","Workdays If Teacher","Is personnel teacher","Is network manager","workdays if Para","Is para","Is PI Para","Is Media Para","Workdays if Guidance","Is Guidance","Works Psych","Is Psych","Is Media Spec","Is Coach","Count months worked from Health","Adjust Health Months for New Hires","Adjust Month total greater than 12","Final Health Months","121","Title I Paid Salary","Retirement","Social Security","Health hidden","Status","SA Pre Approved Amount","Notes","SA Unapproved Amount"]
["School TTI","Full Time Personnel","TBA",null,"Math Coach","6400 - Staff Development",50062366," ","No","2018-08-01","2019-07-31",1,50000,"No","Yes",null,null,{"$f":"IF(E6=\"\",\"\",VLOOKUP(E6,'H - Classifications'!A:F,6,FALSE))","v":4130000},{"$f":"IF(R6=\"\",\"\",Table2[[#This Row],[Functional Area2]]&\"-\"&Table2[[#This Row],[GL Account]])","v":"6400-4130000"},{"$f":"IF(E6=\"\",\"\",INDEX('H - Functional Areas'!B:B,MATCH(Table2[[#This Row],[Functional Area]],'H - Functional Areas'!C:C,0)))","v":6400},{"$f":"IF(Table2[[#This Row],[Type of Personnel Expense]]=\"Special Activity Payroll\",\"\",IF(SUM(AM6,AN6,AP6,AQ6,AR6,AT6,AV6,AW6,AX6)>Table2[[#This Row],[121]],Table2[[#This Row],[121]],SUM(AM6,AN6,AP6,AQ6,AR6,AT6,AV6,AW6,AX6)))","v":196},{"$f":"IF(BD6=\"\",\"\",SUM(AD6,BD6))","v":50500},{"$f":"IF(BE6=\"\",\"\",SUM(AE6,BE6))","v":4171.3},{"$f":"IF(BF6=\"\",\"\",SUM(AF6,BF6))","v":3863.25},{"$f":"IF(O6=\"\",\"\",IF(O6=\"no\",0,BG6*L6))","v":7368},{"$f":"IF(M6=\"\",\"\",('H - Benefit Rates'!$B$4/12*'Personnel Expenditures'!BB6)*'Personnel Expenditures'!L6)","v":19.2},{"$f":"IF(B6=\"\",\"\",V6*'H - Benefit Rates'!$B$6)","v":282.8},{"$f":"IF(Table2[[#This Row],[Type of Personnel Expense]]=\"\",\"\",'Budget Overview'!$A$2)","v":1051},{"$f":"Table2[[#This Row],[Special Activity Pay Rate]]","v":0},{"$f":"IF(Table2[[#This Row],[SA - Pay Rate]]=\"\",\"\",Table2[[#This Row],[SA - Pay Rate]]*Table2[[#This Row],[Number of Special Activity Hours]])","v":0},{"$f":"IF(Table2[[#This Row],[SA - Pay Rate]]=\"\",\"\",Table2[[#This Row],[SA - Total Salary]]*'H - Benefit Rates'!$B$1)","v":0},{"$f":"IF(Table2[[#This Row],[SA - Pay Rate]]=\"\",\"\",Table2[[#This Row],[SA - Total Salary]]*'H - Benefit Rates'!$B$2)","v":0},{"$f":"IF(Table2[[#This Row],[SA - Pay Rate]]=\"\",\"\",Table2[[#This Row],[SA - Total Salary]]*'H - Benefit Rates'!$B$6)","v":0},{"$f":"SUM(AD6,AE6,AF6,AG6)","v":0},{"$f":"IF(M6=\"\",\"\",ROUND(SUM(Z6,Y6,W6,BF6,BD6,AA6),2))","v":66204.55},{"$f":"IF(B6=\"\",\"\",ROUND(SUM(Table2[[#This Row],[SA - Total Salary and Benefits]:[FTP - Total Salary and Benefits]]),2))","v":66204.55},{"$f":"IF(E6=\"\",\"\",VLOOKUP(E6,'H - Classifications'!A:D,3,FALSE))","v":9},{"$f":"NETWORKDAYS(J6,K6,'H - Teacher Unpaid Days Off'!A:A)","v":198},{"$f":"IF(AK6=1,AL6,0)","v":0},{"$f":"IF(AK6=2,AL6,0)","v":0},{"$f":"NETWORKDAYS(J6,K6,'H - Para Unpaid Days Off'!A:A)","v":189},{"$f":"IF(AK6=3,AO6,0)","v":0},{"$f":"IF(AK6=6,AO6,0)","v":0},{"$f":"IF(AK6=8,AO6,0)","v":0},{"$f":"NETWORKDAYS(J6,K6,'H - Guidance Counselor Days Off'!A:A)","v":210},{"$f":"IF(AK6=4,AS6,0)","v":0},{"$f":"NETWORKDAYS(J6,K6,'H- School Psychologist Days Off'!A:A)","v":198},{"$f":"IF(AK6=5,AU6,0)","v":0},{"$f":"IF(AK6=7,AL6,0)","v":0},{"$f":"IF(AK6=9,AL6,0)","v":198},{"$f":"IF(Table2[[#This Row],[Health Insurance Taken]]=\"\",\"\",(DATEDIF(Table2[[#This Row],[Start Date]],Table2[[#This Row],[End Date]],\"m\"))+1)","v":12},{"$f":"IF(I6=\"yes\",(AY6-3),AY6)","v":12},{"$f":"IF(AZ6>12,12,AZ6)","v":12},{"$f":"IF(Table2[[#This Row],[Adjust Month total greater than 12]]<0,0,Table2[[#This Row],[Adjust Month total greater than 12]])","v":12},{"$f":"IF(E6=\"\",\"\",VLOOKUP(E6,'H - Classifications'!A:D,4,FALSE))","v":196},{"$f":"IF(U6=\"\",\"0\",(((M6*L6)/BC6)*U6)*(1+'H - Benefit Rates'!$B$7))","v":50500},{"$f":"IF(U6=\"\",\"0\",IF(N6=\"yes\",ROUND(BD6*'H - Benefit Rates'!$B$5,2),ROUND(BD6*'H - Benefit Rates'!$B$1,2)))","v":4171.3},{"$f":"IF(U6=\"\",\"0\",ROUND('H - Benefit Rates'!$B$2*BD6,2))","v":3863.25},{"$f":"('H - Benefit Rates'!$B$3/12)*BB6","v":7368},null,null,null,{"$f":"IF(Table2[[#This Row],[SA Pre Approved Amount]]=\"\",\"\",Table2[[#This Row],[Total Salary and Benefits]]-Table2[[#This Row],[SA Pre Approved Amount]])","v":""}]
{"$rows_left_out":53}
{"sheet":"H - Classifications","index":6,"n_rows":40,"n_cols":7,"rows_kept":40,"cut":false,"hidden":true,"merged":[]}
["Classroom Teacher ",5100,1,196,"5100-4120000",4120000,{"$f":"'H - Benefit Rates'!$B$8","v":21}]
["Non Classroom Teacher",5100,1,196,"5100-4130000",4130000,{"$f":"'H - Benefit Rates'!$B$8","v":21}]
["Student Success Coach",5100,1,196,"5100-4130000",4130000,{"$f":"'H - Benefit Rates'!$B$8","v":21}]
["Instructional Coach",6400,9,196,"6400-4130000",4130000,{"$f":"'H - Benefit Rates'!$B$8","v":21}]
["Testing Coordinator",5100,1,196,"5100-4130000",41300000,21]
["Reading Interventionist",5100,1,196,"5100-4130000",4130000,{"$f":"'H - Benefit Rates'!$B$8","v":21}]
{"$rows_left_out":35}
{"sheet":"H - Benefit Rates","index":7,"n_rows":12,"n_cols":38,"rows_kept":12,"cut":false,"hidden":true,"merged":[]}
["Retirement",8.2600000000000007E-2]
["Social Security",7.6499999999999999E-2]
["Health Insurance",7368]
["Life Insurance",19.2]
["DROP",0.14030000000000001,null,null,null,null,null,null,null,null,null,null,null,null,null,null,null,null,null,null,null,null,null,null,null,null,null,null,null,null,null,null,null,null,null,null,null,{"$f":"IF(AK5=\"no\", 0,'H - Benefit Rates'!B3)","v":7368}]
["Workers Comp",5.5999999999999999E-3]
{"$rows_left_out":7}
{"sheet":"H - Pivots","index":8,"n_rows":174,"n_cols":6,"rows_kept":174,"cut":false,"hidden":true,"merged":[[37,0,37,1]]}
["GL Account","(All)"]
[]
["Row Labels","Sum of Total Cost of Expenditure"]
["Substitutes",6.1517819317697842E-2]
["Supplies",0.17976236197893439]
["Full Time Personnel",0.7587198187033678]
{"$rows_left_out":169}
{"sheet":"Expenditures","index":9,"n_rows":102,"n_cols":15,"rows_kept":102,"cut":false,"hidden":false,"merged":[[0,1,0,12],[2,13,2,14],[1,4,1,6],[1,7,1,8]]}
[null,"Title I Planned Expenditures 2018-2019"]
[null,{"$f":"'Budget Overview'!A1","v":"Tenoroc High"},null,{"$f":"'Budget Overview'!A2","v":1051},"Remaining Unplanned Total Balance",null,null,{"$f":"'Budget Overview'!H9","v":0},null,null,null,null,"Guidance"]
[null,null,null,null,null,null,null,null,null,null,null,null,null,"Office Use Only"]
["School Number","Description","Strategy","Type of Expenditure","Functional Area","GL Account","Amount of Expenditure (Not Subs)","Number of Subs Per Day","Number of Sub Days","Functional Area  Actual","GL Account Actual","Total Sub Pay","Total Cost of Expenditure","In SIP Budget?","Notes"]
[{"$f":"'Budget Overview'!$A$2","v":1051},"Full Time Personnel",null,"Full Time Personnel",null,null,{"$f":"GETPIVOTDATA(\"Total Salary and Benefits\",'H - Pivots'!$A$95)","v":107349.34},null,null,{"$f":"INDEX('H - Functional Areas'!B:B,MATCH(Table100[Functional Area],'H - Functional Areas'!C:C,0))","v":{"$error":"#N/A"}},{"$f":"INDEX('H - GL Accounts'!A:A,MATCH(Table100[GL Account],'H - GL Accounts'!C:C,0))","v":{"$error":"#N/A"}},{"$f":"IF(Table100[Type of Expenditure]=\"Substitutes\",(Table100[[#This Row],[Number of Subs Per Day]]*Table100[[#This Row],[Number of Sub Days]])*'H - Benefit Rates'!$B$12,0)","v":0},{"$f":"IF(Table100[[#This Row],[Description]]=\"\",\"\",SUM(G5,L5))","v":107349.34}]
[{"$f":"'Budget Overview'!$A$2","v":1051},"Special Activity Payroll",null,"Special Activity",null,null,{"$f":"GETPIVOTDATA(\"Total Salary and Benefits\",'H - Pivots'!$A$116)","v":15365.54},null,null,{"$f":"INDEX('H - Functional Areas'!B:B,MATCH(Table100[Functional Area],'H - Functional Areas'!C:C,0))","v":{"$error":"#N/A"}},{"$f":"INDEX('H - GL Accounts'!A:A,MATCH(Table100[GL Account],'H - GL Accounts'!C:C,0))","v":{"$error":"#N/A"}},{"$f":"IF(Table100[Type of Expenditure]=\"Substitutes\",(Table100[[#This Row],[Number of Subs Per Day]]*Table100[[#This Row],[Number of Sub Days]])*'H - Benefit Rates'!$B$12,0)","v":0},{"$f":"IF(Table100[[#This Row],[Description]]=\"\",\"\",SUM(G6,L6))","v":15365.54}]
{"$rows_left_out":97}
{"sheet":"H - Functional Areas","index":10,"n_rows":15,"n_cols":3,"rows_kept":15,"cut":false,"hidden":true,"merged":[]}
["Column1","Column2","Func Description"]
["Instructional",5100,"5100 - Instructional"]
["ESE",5200,"5200 - ESE"]
["Workforce",5300,"5300 - Workforce"]
["Adult Education",5400,"5400 - Adult Education"]
["Early Learning",5500,"5500 - Early Learning"]
{"$rows_left_out":10}
{"sheet":"H- Types of Expenditures","index":11,"n_rows":16,"n_cols":1,"rows_kept":16,"cut":false,"hidden":true,"merged":[]}
["Substitutes"]
["Resources (Manipulatives, Workbooks, etc)"]
["Extended Learning (Tutoring, Summer Learning)"]
["Technology Items"]
["Furniture and Equipment"]
["Online Subscriptions"]
{"$rows_left_out":11}
{"sheet":"H - GL Accounts","index":12,"n_rows":38,"n_cols":3,"rows_kept":38,"cut":false,"hidden":true,"merged":[]}
[4310000,"Prof. & Tech. Services, Consultants",{"$f":"A1&\" \"&\"-\"&\" \"&B1","v":"4310000 - Prof. & Tech. Services, Consultants"}]
[4310300,"Substitutes","4310300 - Substitutes"]
[4319000,"Tech Related Prof. & Tech. Services","4319000 - Tech Related Prof. & Tech. Services"]
[4330000,"Travel - Training, Field Trip Admission Fees","4330000 - Travel - Training, Field Trip Admission Fees"]
[4350000,"Repairs and Maintenance","4350000 - Repairs and Maintenance"]
[4359000,"Tech Related Repairs and Maintenance","4359000 - Tech Related Repairs and Maintenance"]
{"$rows_left_out":33}
{"sheet":"Funds Management","index":13,"n_rows":20,"n_cols":33,"rows_kept":20,"cut":false,"hidden":false,"merged":[[0,21,0,32],[1,21,1,32]]}
[null,null,null,null,null,null,null,null,null,null,null,null,null,null,null,null,null,null,null,null,null,"Title I Funds Management Report"]
[null,null,null,null,null,null,null,null,null,null,null,null,null,null,null,null,null,null,null,null,null,{"$f":"'Budget Overview'!A1","v":"Tenoroc High"}]
["Grant","Grant Description","Fund","Fund Name","Funded Program","Funded Program Desc","WBS Element","Funds Center","Funds Center Name","Func Area Rollup","FArea Rollup Desc","FA-CI","FA-CI2","Indiv. Salary Totals","PI Totals","Class","Salary - Budget","Budget - Other","Encumberances - Other","Actuals - Other","Balance - Other","Functional Area","Functional Area Desc","AVC Rollup","Description","Commitment Item","Commit. Item Desc","Budget","Actual Cost of Employees","Money to Move","Encumbrances","Actuals","Balance"]
["NR","Not-Relevant","42041019","TITLE I 19","G42041019-01","TT119-PUBLIC SCHOOLS",null,"1051000000","Tenoroc High School","5000","AVC Instruction",{"$f":"V4&\"-\"&Z4","v":"5100-4330000"},"5100-4330000",{"$f":"IFERROR(INDEX('FM Calculations'!$C$1:$C$600,MATCH(Table1[[#This Row],[FA-CI2]],'FM Calculations'!$A$1:$A$600,0)),0)","v":0},{"$f":"IF('Funds Management'!$V4=\"6150\",SUM('Funds Management'!$AE4:$AF4),0)","v":0},{"$f":"IFERROR(INDEX('FM Calculations'!B:B,MATCH('Funds Management'!L:L,'FM Calculations'!A:A,0)),0)","v":0},{"$f":"IF('Funds Management'!$P4=\"S\",'Funds Management'!$AB4,0)","v":0},{"$f":"IF('Funds Management'!$P4=0,'Funds Management'!$AB4,0)","v":21000},{"$f":"IF('Funds Management'!$P4=0,'Funds Management'!$AE4,0)","v":0},{"$f":"IF('Funds Management'!$P4=0,'Funds Management'!$AF4,0)","v":0},{"$f":"IF('Funds Management'!$P4=0,'Funds Management'!$AG4,0)","v":21000},"5100","I-Basic Instruction","43","Purchased Services","4330000","Travel",21000,{"$f":"IF(Table1[[#This Row],[Class]]=\"S\",Table1[[#This Row],[Indiv. Salary Totals]],\"\")","v":""},{"$f":"IF(Table1[[#This Row],[Class]]=\"s\",Table1[[#This Row],[Budget]]-Table1[[#This Row],[Actual Cost of Employees]],\"\")","v":""},0,0,21000]
["NR","Not-Relevant","42041019","TITLE I 19","G42041019-01","TT119-PUBLIC SCHOOLS",null,"1051000000","Tenoroc High School","5000","AVC Instruction","5100-4510000","5100-4510000",{"$f":"IFERROR(INDEX('FM Calculations'!$C$1:$C$600,MATCH(Table1[[#This Row],[FA-CI2]],'FM Calculations'!$A$1:$A$600,0)),0)","v":0},{"$f":"IF('Funds Management'!$V5=\"6150\",SUM('Funds Management'!$AE5:$AF5),0)","v":0},{"$f":"IFERROR(INDEX('FM Calculations'!B:B,MATCH('Funds Management'!L:L,'FM Calculations'!A:A,0)),0)","v":0},{"$f":"IF('Funds Management'!$P5=\"S\",'Funds Management'!$AB5,0)","v":0},{"$f":"IF('Funds Management'!$P5=0,'Funds Management'!$AB5,0)","v":21265.24},{"$f":"IF('Funds Management'!$P5=0,'Funds Management'!$AE5,0)","v":0},{"$f":"IF('Funds Management'!$P5=0,'Funds Management'!$AF5,0)","v":0},{"$f":"IF('Funds Management'!$P5=0,'Funds Management'!$AG5,0)","v":21265.24},"5100","I-Basic Instruction","45","Materials and Supplies","4510000","Supplies",21265.24,{"$f":"IF(Table1[[#This Row],[Class]]=\"S\",Table1[[#This Row],[Indiv. Salary Totals]],\"\")","v":""},{"$f":"IF(Table1[[#This Row],[Class]]=\"s\",Table1[[#This Row],[Budget]]-Table1[[#This Row],[Actual Cost of Employees]],\"\")","v":""},0,0,21265.24]
["NR","Not-Relevant","42041019","TITLE I 19","G42041019-01","TT119-PUBLIC SCHOOLS",null,"1051000000","Tenoroc High School","5000","AVC Instruction","5100-4642000","5100-4642000",{"$f":"IFERROR(INDEX('FM Calculations'!$C$1:$C$600,MATCH(Table1[[#This Row],[FA-CI2]],'FM Calculations'!$A$1:$A$600,0)),0)","v":0},{"$f":"IF('Funds Management'!$V6=\"6150\",SUM('Funds Management'!$AE6:$AF6),0)","v":0},{"$f":"IFERROR(INDEX('FM Calculations'!B:B,MATCH('Funds Management'!L:L,'FM Calculations'!A:A,0)),0)","v":0},{"$f":"IF('Funds Management'!$P6=\"S\",'Funds Management'!$AB6,0)","v":0},{"$f":"IF('Funds Management'!$P6=0,'Funds Management'!$AB6,0)","v":4266},{"$f":"IF('Funds Management'!$P6=0,'Funds Management'!$AE6,0)","v":4266},{"$f":"IF('Funds Management'!$P6=0,'Funds Management'!$AF6,0)","v":0},{"$f":"IF('Funds Management'!$P6=0,'Funds Management'!$AG6,0)","v":0},"5100","I-Basic Instruction","46","Capital Outlay","4642000","Noncap F.F. & E.",4266,{"$f":"IF(Table1[[#This Row],[Class]]=\"S\",Table1[[#This Row],[Indiv. Salary Totals]],\"\")","v":""},{"$f":"IF(Table1[[#This Row],[Class]]=\"s\",Table1[[#This Row],[Budget]]-Table1[[#This Row],[Actual Cost of Employees]],\"\")","v":""},4266,0,0]
{"$rows_left_out":15}
{"sheet":"Remaining Balance","index":14,"n_rows":28,"n_cols":8,"rows_kept":28,"cut":false,"hidden":false,"merged":[[27,0,27,6],[23,2,23,6],[18,2,18,6],[12,2,12,6],[21,2,21,6],[15,0,15,5],[17,0,17,5],[19,0,19,5],[22,0,22,5],[20,0,20,5],[11,0,11,5],[13,0,13,5],[0,0,0,6],[1,0,1,6],[2,0,2,6],[3,0,3,6],[5,0,5,5],[7,0,7,5],[9,0,9,5],[10,0,10,5]]}
["Title I Budget "]
["Remaining Balance"]
[{"$f":"'Budget Overview'!A1","v":"Tenoroc High"}]
["2018-2019"]
[]
["Projected Personnel Salary and Benefits (Personnel Tab)",null,null,null,null,null,{"$f":"SUM(Expenditures!M5,Expenditures!M6)","v":122714.88}]
{"$rows_left_out":23}
{"sheet":"H-RB Summary","index":15,"n_rows":2,"n_cols":6,"rows_kept":2,"cut":false,"hidden":true,"merged":[]}
["Location Name","Location Number","Remaining PI Minimum","Remaining Unspent Non-Parent Involvement Balance","Remaining Unplanned","Remaining Balance - Special Activity Planned"]
[{"$f":"Expenditures!B2","v":"Tenoroc High"},{"$f":"Expenditures!D2","v":1051},{"$f":"'Remaining Balance'!G21","v":1341.78},{"$f":"'Remaining Balance'!G23","v":119396.36},{"$f":"Expenditures!H2","v":0},{"$f":"'Remaining Balance'!G23-Expenditures!G6","v":104030.82}]

{"sheet":"Special Activity Expenditures","index":16,"n_rows":116,"n_cols":25,"rows_kept":116,"cut":false,"hidden":false,"merged":[[0,0,0,8],[1,0,1,8],[2,0,2,8]]}
["Special Activity Payroll Expenditures"]
["Title I, School Wide 2018-2019"]
[{"$f":"'Budget Overview'!A1","v":"Tenoroc High"}]
[]
["Special Activity Description","Month","Total","Date","Notes"]
[null,"January"]
{"$rows_left_out":111}
{"sheet":"Comparison Sheet","index":17,"n_rows":188,"n_cols":12,"rows_kept":188,"cut":false,"hidden":true,"merged":[[0,0,0,5],[1,0,1,5]]}
["Comparison Sheet - Salary Analysis/Fund Management Report ",null,null,null,null,null,null,"Total Budgeted",null,"Total Projected",null,"Total Difference"]
["Title I Schoolwide Funds     2018-2019",null,null,null,null,null,null,{"$f":"SUM(H8:H188)","v":127142},null,{"$f":"SUM(J8:J188)","v":122714.87456746939},null,{"$f":"SUM(L8:L188)","v":4427.1254325306145}]
[null,"School Name",{"$f":"'Budget Overview'!A1","v":"Tenoroc High"}]
[]
[null,null,null,null,null,null,null,"Amount Budgeted",null,"Title I Paid Employees"]
["Description",null,"Function",null,null,"GL Acct",null,"on Fund Mgmt Rpt",null,"Anticipated Actual Expense",null,"Difference"]
{"$rows_left_out":183}
{"sheet":"FM Calculations","index":18,"n_rows":162,"n_cols":5,"rows_kept":162,"cut":false,"hidden":true,"merged":[]}
["Funct-GL","Salary","Cost","Center","Function"]
["5100-4120000","S",{"$f":"IFERROR(GETPIVOTDATA(\"Title I Paid Salary Final\",'H - Pivots'!$A$39,\"Funct-GL Account\",A2),0)","v":0},{"$f":"'Budget Overview'!$A$2","v":1051},{"$f":"LEFT(A2,4)","v":"5100"}]
["5100-4130000","S",{"$f":"IFERROR(GETPIVOTDATA(\"Title I Paid Salary Final\",'H - Pivots'!$A$39,\"Funct-GL Account\",A3),0)","v":0},{"$f":"'Budget Overview'!$A$2","v":1051},{"$f":"LEFT(A3,4)","v":"5100"}]
["5100-4150000","S",{"$f":"IFERROR(GETPIVOTDATA(\"Title I Paid Salary Final\",'H - Pivots'!$A$39,\"Funct-GL Account\",A4),0)","v":0},{"$f":"'Budget Overview'!$A$2","v":1051},"5100"]
["5100-4152000","S",{"$f":"IFERROR(GETPIVOTDATA(\"Title I Paid Salary Final\",'H - Pivots'!$A$39,\"Funct-GL Account\",A5),0)","v":0},{"$f":"'Budget Overview'!$A$2","v":1051},"5100"]
["5100-4160000","S",{"$f":"IFERROR(GETPIVOTDATA(\"Title I Paid Salary Final\",'H - Pivots'!$A$39,\"Funct-GL Account\",A6),0)","v":0},{"$f":"'Budget Overview'!$A$2","v":1051},"5100"]
{"$rows_left_out":157}
{"sheet":"H - School Names and Number","index":19,"n_rows":174,"n_cols":2,"rows_kept":174,"cut":false,"hidden":true,"merged":[]}
["Site Number","Choose School Name"]
[8031,"Achievement Academy"]
[331,"Alta Vista Elementary"]
[1041,"Alturas Elementary"]
[851,"Auburndale Central Elementary"]
[811,"Auburndale Senior High"]
{"$rows_left_out":169}
{"sheet":"H - Teacher Unpaid Days Off","index":20,"n_rows":119,"n_cols":1,"rows_kept":119,"cut":false,"hidden":true,"merged":[]}
["2018-07-01"]
["2018-07-02"]
["2018-07-03"]
["2018-07-04"]
["2018-07-05"]
["2018-07-06"]
{"$rows_left_out":114}
{"sheet":"H - Guidance Counselor Days Off","index":21,"n_rows":91,"n_cols":1,"rows_kept":91,"cut":false,"hidden":true,"merged":[]}
["2018-07-01"]
["2018-07-02"]
["2018-07-03"]
["2018-07-04"]
["2018-07-05"]
["2018-07-06"]
{"$rows_left_out":86}
{"sheet":"H- School Psychologist Days Off","index":22,"n_rows":119,"n_cols":1,"rows_kept":119,"cut":false,"hidden":true,"merged":[]}
["2018-07-01"]
["2018-07-02"]
["2018-07-03"]
["2018-07-04"]
["2018-07-05"]
["2018-07-06"]
{"$rows_left_out":114}
{"sheet":"H - Para Unpaid Days Off","index":23,"n_rows":131,"n_cols":2,"rows_kept":131,"cut":false,"hidden":true,"merged":[]}
["2018-07-01","Summer up to first work day"]
["2018-07-02","Summer up to first work day"]
["2018-07-03","Summer up to first work day"]
["2018-07-04","Summer up to first work day"]
["2018-07-05","Summer up to first work day"]
["2018-07-06","Summer up to first work day"]
{"$rows_left_out":126}
{"sheet":"H - Month Calculations","index":24,"n_rows":12,"n_cols":2,"rows_kept":12,"cut":false,"hidden":true,"merged":[]}
[1,6]
[2,7]
[3,8]
[4,9]
[5,10]
[6,11]
{"$rows_left_out":6}